{"text_format":"3","workbook":"xlsx","n_sheets":10,"sheets":["Instruktion","Förekomstformer","Indata","samband_HP_H_1","samband_HP_H_2","HP_4_8_6A","HP_6B","HP_5_7_10_11_13","Ekotox","Sammanfattning"],"not_rendered":{"defined_names":9},"read":"whole","date_system":"1900"}

{"sheet":"Instruktion","index":0,"n_rows":26,"n_cols":2,"rows_kept":26}
[]
[null,"SÅ HÄR KAN EN KALKYL GÖRAS"]
[]
[null,"Läs Klassning av förbränningsrester som farligt eller icke farligt avfall (Energiforskrapport 2017:423, Avfall Sveriges rapport) innan kalkylen påbörjas."]
[null,"Observera att det är anläggningsägarens ansvar att klassningen blir korrekt utförd. Detta verktyg ska ses som en hjälp i denna klassning och ska tillämpas med omdöme."]
[]
[]
[null,"Ta fram data"]
[1,"Ta minst fem delprover av den aktuella förbränningsresten under olika dagar"]
[{"$f":"1+A9","v":2},"Mät upp lika delar och homogenisera"]
[3,"Tag ut ett delprov och sänd till analyslaboratorium för totalanalys (analys av grundämnen)"]
[4,"Tag ut ett delprov och åldra med vatten i slutet kärl under minst en vecka enligt Avfall Sverige rapport U2011:22"]
[5,"Sänd det åldrade provet till analyslaboratoriet för laktest enligt SS-EN 12457-3, utgåva 1 (skaktest L/S 2+8)"]
[]
[null,"Gör kalkyl för värsta rimligen förekommande fall"]
[1,"För in data från totalanalys i grönmarkerade rutor i kolumn \"B\" på sidan \"Indata\""]
[2,"Vissa askor avger ammoniak i samband med att de befuktas. Kalkylbladet ger möjlighet att ta med detta genom att man anger halten ingående kväve. Det är dock okänt om någon hittills har inkluderat ammoniak i sina klassningskalkyler. "]
[3,"Resultatet visas nu i sammanfattning i blad \"Sammanfattning\", se även bladen \"HP_4_8_6A\", \"HP_6B\", \"HP_5_7_10_11_13\" och \"Ekotox\""]
[]
[null,"Fortsätt med att göra en kalkyl för ett försiktigt valt fall"]
[0,"OBS! Spara resultatet för värsta fallet innan Du fortsätter! (D. v. s. om så önskas). "]
[1,"Beräkna fördelning mellan vissa förekomstformer för ämnena koppar, krom, nickel, vanadin och zink enligt kalkylbaldet \"Förekomstformer\". Förutsättningarna för kalkylen finns beskrivna i avsnitt 5.1 i rapporten. "]
[2,"Kalkylbladet ger möjlighet att inkludera olika former av arsenik. Här finns dock inte något underlag för att differentiera mellan olika förekomstformer. Värsta formen, d. v. s. arsenik-V-oxid bör därför användas. "]
[]
[null,"Övrigt att tänka på"]
[1,"I vissa fall behöver man också skicka samt utvärdera prov för dioxin, se avsnitt 4.4 i rapporten. "]

{"sheet":"Förekomstformer","index":1,"n_rows":28,"n_cols":7,"rows_kept":28}
[]
[]
[null,"KALKYL FÖR FÖRDELNING AV FÖREKOMSTFORMER"]
[]
[null,"Kalkylerna nedan kan bara utföras när totalhalterna är ifyllda i indata"]
[]
[null,"Ange viktsprocent Fe2O3"]
[null,"Antal atomviktsekvivalenter Fe mmoler/kg",{"$nulls":4},{"$f":"G7*20000/(2*55.85+3*16)","v":0}]
[null,"2 * Summa atomviktsekvivalenter "]
[null,"Cr, Cu, Ni, V, Zn mmoler/kg",{"$nulls":4},{"$f":"2*(Indata!B15/63.55+Indata!B20/58.69+Indata!B22/50.94+Indata!B25/65.39+Indata!B17/52)","v":0}]
[null,"(Halter tagna från Indata)"]
[null,"Gå vidare? ",null,{"$f":"IF(G8>G10,\"Fördelning kan göras, gå vidare\",\"Fördelning bör ej göras, gå ej vidare\")","v":"Fördelning bör ej göras, gå ej vidare"}]
[]
[]
[null,"För in lakdata (L/S 10) i mg/kg TS för förbränningsresten "]
[]
[null,"Cr","Cu","Ni","V","Zn"]
[]
[]
[null,"Kalkylering av lägsta procenttal för värsta formen.  "]
[null,"(Totalhalter tas från indata). "]
[]
[null,"Cr","Cu","Ni","V","Zn"]
[null,{"$f":"IF(Indata!B17*Förekomstformer!B18=0,100,B18*100/Indata!B17+5)","v":100},{"$f":"IF(Indata!B15*Förekomstformer!C18=0,100,C18*100/Indata!B15+5)","v":100},{"$f":"IF(Indata!B20*Förekomstformer!D18=0,100,D18*100/Indata!B20+5)","v":100},{"$f":"IF(Indata!B22*Förekomstformer!E18=0,100,E18*100/Indata!B22+5)","v":100},{"$f":"IF(Indata!B25*Förekomstformer!F18=0,100,F18*100/Indata!B25+5)","v":100}]
[]
[null,"För in procenttalen i de gula rutorna ovan i de gröna fälten"]
[null,"i kolumn D i kalkylblad \"Indata\""]
[null,"Observera! Om lakdata saknas ska antagandet vara 100 %. "]

{"sheet":"Indata","index":2,"n_rows":29,"n_cols":8,"rows_kept":29}
[null,null,"KALKYL ENLIGT DE NYA KLASSNINGSREGLERNA "]
[null,null,"Enligt EU-förordningen 1357/2014 som gäller från 2015-06-01"]
[null,null,"Enligt Avfallsförordningen SFS 2011-:927"]
[null,null,"Enligt KIFS 2007:05 som utgör grunden för klassning som ekotoxiskt"]
[null,null,"Version 2015-03-07","uppdat 2017-05-03, 2017-08-28 och 2017-11-19"]
[null,"Data",null,"Andelar ","Element","Omvand-",null,"För"]
["Grundämnen","totalanalys","Referens-","av element","räknas ","lings-","resultat","kalkyl"]
[null,"mg/kg","substanser","vikts-%","som","faktor","mg/kg","%"]
["antimon",null,"antimon(III)oxid",100,"antimon(III)oxid",1.197,{"$f":"B9*D9/100*F9","v":0},{"$f":"G9/10000","v":{"v":0,"d":"0.0000"}}]
["arsenik",null,"arsenik(III)oxid",100,"arsenik(III)oxid",1.32,{"$f":"B10*D10/100*F10","v":0},{"$f":"G10/10000","v":{"v":0,"d":"0.0000"}}]
[null,null,"arsenik(V)oxid",{"$f":"100-D10","v":0},"arsenik(V)oxid",1.534,{"$f":"B10*D11/100*F11","v":0},{"v":0,"d":"0.0000"}]
["barium",null,"barium(II)oxid",100,"barium(II)oxid",1.117,0,{"v":0,"d":"0.0000"}]
["bly",null,"bly(II)oxid",100,"bly(II)oxid",1.077,0,{"v":0,"d":"0.0000"}]
["kobolt",null,"kobolt(II)oxid",100,"kobolt(II)oxid",1.362,0,{"v":0,"d":"0.0000"}]
["koppar",null,"koppar(II)oxid",100,"koppar(II)oxid",1.252,0,{"v":0,"d":"0.0000"}]
[null,null,"järnrik kopparslagg",{"$f":"100-D15","v":0},"CuFe2O4",4.281,{"$f":"B15*D16/100*F16","v":0},{"v":0,"d":"0.0000"}]
["krom",null,"krom(VI)oxid",0,"krom(VI)oxid",1.923,0,{"v":0,"d":"0.0000"}]
[null,null,"krom(III)oxid",{"$f":"100-D17","v":100},"krom(III)oxid",1.462,{"$f":"B17*D18/100*F18","v":0},{"v":0,"d":"0.0000"}]
["molybden",null,"molybden(VI)oxid",100,"molybden(VI)oxid",1.5,0,{"v":0,"d":"0.0000"}]
["nickel",null,"nickel(II)oxid",100,"nickel(II)oxid",1.273,0,{"v":0,"d":"0.0000"}]
[null,null,"ferronickelslagg",{"$f":"100-D20","v":0},"NiFe2O4",3.993,{"$f":"B20*D21/100*F21","v":0},{"v":0,"d":"0.0000"}]
["vanadin",null,"vanadin(V)oxid",100,"vanadin(V)oxid",1.785,0,{"v":0,"d":"0.0000"}]
[null,null,"ferrovanadin",{"$f":"100-D22","v":0},"FeV2O4",2.176,{"$f":"B22*D23/100*F23","v":0},{"v":0,"d":"0.0000"}]
["volfram",null,"volfram(VI)oxid",100,"volfram(VI)oxid",1.261,0,{"v":0,"d":"0.0000"}]
["zink",null,"zink(II)oxid",100,"zink(II)oxid",1.245,0,{"v":0,"d":"0.0000"}]
[null,null,"Franklinit",{"$f":"100-D25","v":0},"ZnFe2O4",3.687,{"$f":"B25*D26/100*F26","v":0},{"v":0,"d":"0.0000"}]
["kadmium",null,"kadmium(II)klorid",100,"kadmium(II)klorid",1.631,0,{"v":0,"d":"0.0000"}]
["kvicksilver",null,"kvicksilver(II)klorid",100,"kvicksilver(II)klorid",1.354,0,{"v":0,"d":"0.0000"}]
["kväve",null,"ammoniak",100,"NH3",1.216,{"$f":"B29*D29/100*F29","v":0},{"$f":"G29/10000","v":{"v":0,"d":"0.0000"}}]

{"sheet":"samband_HP_H_1","index":3,"n_rows":28,"n_cols":17,"rows_kept":28}
[]
["Samband mellan HP (hazard potential, \"avfallsfarlighet\") i EU-förordning 1357/2014 och  "]
["H (faroangivelse) och Farokategori i CLP (EU-förordning 1272/2008) ",{"$nulls":10},"fortsättning nästa sida"]
[]
["Avfallsfarlighet","HP6","HP6","HP6","HP6","HP6","HP6","HP6","HP6","HP4","HP8","HP8","HP4","HP13","HP4","HP4","H315"]
["Faroangivelse ","H300","H300","H301","H302","H310","H310","H311","H312","H314","H314","H314","H315","H317","H318","H319","och"]
["Farokategori",1,2,null,null,1,2,null,null,"1A","1B","1C",{"$nulls":4},"H319"]
["antimon(III)oxid",{"$nulls":15},{"$f":"IF(M8+P8>0,1,\" \")","v":" "}]
["arsenik(III)oxid",null,1,{"$nulls":6},1,{"$nulls":6},{"$f":"IF(M9+P9>0,1,\" \")","v":" "}]
["arsenik(V)oxid",null,null,1,{"$nulls":12}," "]
["barium(II)oxid",{"$nulls":3},1,{"$nulls":11}," "]
["bly(II)oxid",{"$nulls":3},1,{"$nulls":11}," "]
["kobolt(II)oxid",{"$nulls":3},1,{"$nulls":8},1,null,null," "]
["koppar(II)oxid",{"$nulls":3},1,{"$nulls":11}," "]
["CuFe2O4",{"$nulls":15}," "]
["krom(VI)oxid",null,null,1,{"$nulls":3},1,null,1,{"$nulls":3},1,null,null," "]
["krom(III)oxid",{"$nulls":15}," "]
["molybden(VI)oxid",{"$nulls":14},1,1]
["nickel(II)oxid",{"$nulls":12},1,null,null," "]
["NiFe2O4",{"$nulls":15}," "]
["vanadin(V)oxid",{"$nulls":3},1,{"$nulls":11}," "]
["FeV2O4",{"$nulls":15}," "]
["volfram(VI)oxid",{"$nulls":3},1,{"$nulls":7},1,null,null,1,1]
["zink(II)oxid",{"$nulls":15}," "]
["ZnFe2O4",{"$nulls":15}," "]
["kadmium(II)klorid",null,null,1,{"$nulls":12}," "]
["kvicksilver(II)klorid",null,1,{"$nulls":7},1,{"$nulls":5}," "]
["ammoniak",{"$nulls":9},1,{"$nulls":5},{"$f":"IF(M28+P28>0,1,\" \")","v":" "}]

{"sheet":"samband_HP_H_2","index":4,"n_rows":28,"n_cols":17,"rows_kept":28}
[]
["Samband mellan HP (hazard potential, \"avfallsfarlighet\") i EU-förordning 1357/2014 och  "]
["H (faroangivelse) och Farokategori i CLP (EU-förordning 1272/2008) ",{"$nulls":10},"från föregående sida"]
[]
["Avfallsfarlighet","HP6","HP6","HP6","HP6","HP13","HP5","HP11","HP11","HP7","HP7","HP10","HP10","HP5","HP5","HP5","HP5"]
["Faroangivelse CLP","H330","H330","H331","H332","H334","H335","H340","H341","H350","H351","H360","H361","H370","H371","H372","H373"]
["Farokategori CLP",1,2]
["antimon(III)oxid",{"$nulls":9},1]
["arsenik(III)oxid",{"$nulls":8},1]
["arsenik(V)oxid",null,null,1,{"$nulls":5},1]
["barium(II)oxid",{"$nulls":3},1]
["bly(II)oxid",{"$nulls":3},1,{"$nulls":6},1,{"$nulls":4},1]
["kobolt(II)oxid"]
["koppar(II)oxid"]
["CuFe2O4"]
["krom(VI)oxid",null,1,null,null,1,null,1,null,1,null,null,1,null,null,1]
["krom(III)oxid"]
["molybden(VI)oxid",{"$nulls":5},1,{"$nulls":3},1]
["nickel(II)oxid",{"$nulls":8},1,{"$nulls":5},1]
["NiFe2O4"]
["vanadin(V)oxid",{"$nulls":3},1,null,1,null,1,{"$nulls":3},1,null,null,1]
["FeV2O4"]
["volfram(VI)oxid",{"$nulls":5},1]
["zink(II)oxid"]
["ZnFe2O4"]
["kadmium(II)klorid",null,1,{"$nulls":4},1,null,1,null,1,{"$nulls":3},1]
["kvicksilver(II)klorid",{"$nulls":7},1,{"$nulls":3},1,null,null,1]
["ammoniak",null,null,1]

{"sheet":"HP_4_8_6A","index":5,"n_rows":32,"n_cols":10,"rows_kept":32}
[]
[]
["Kalkyler för HP 4 HP 8 och del av HP6"]
[]
["Avfallsfarlighet","För",null,"HP4","HP4","HP4","HP8","HP6","HP6","HP6"]
["Faroangivelse","kalkyl","> 1 %","H314","H318","H315+H319","H314","H302","H312","H332"]
["Farokategori","%",null,"1A",null,null,"1A-1C"]
["antimon(III)oxid",{"$f":"Indata!H9","v":{"v":0,"d":"0.0000"}},{"$f":"IF(B8>1,\"ja\",\"nej\")","v":"nej"},{"$f":"$B8*samband_HP_H_1!J8","v":{"v":0,"d":"0.0000"}},{"$f":"$B8*samband_HP_H_1!O8","v":{"v":0,"d":"0.0000"}},{"$f":"$B8*IF(samband_HP_H_1!Q8=1,1,0)","v":{"v":0,"d":"0.0000"}},{"$f":"$B8*(samband_HP_H_1!J8+samband_HP_H_1!K8+samband_HP_H_1!L8)","v":{"v":0,"d":"0.0000"}},{"$f":"$B8*samband_HP_H_1!E8","v":{"v":0,"d":"0.0000"}},{"$f":"$B8*samband_HP_H_1!I8","v":{"v":0,"d":"0.0000"}},{"$f":"$B8*samband_HP_H_2!E8","v":{"v":0,"d":"0.0000"}}]
["arsenik(III)oxid",{"$f":"Indata!H10","v":{"v":0,"d":"0.0000"}},{"$f":"IF(B9>1,\"ja\",\"nej\")","v":"nej"},{"$f":"B9*samband_HP_H_1!J9","v":{"v":0,"d":"0.0000"}},{"$f":"$B9*samband_HP_H_1!O9","v":{"v":0,"d":"0.0000"}},{"$f":"$B9*IF(samband_HP_H_1!Q9=1,1,0)","v":{"v":0,"d":"0.0000"}},{"$f":"$B9*(samband_HP_H_1!J9+samband_HP_H_1!K9+samband_HP_H_1!L9)","v":{"v":0,"d":"0.0000"}},{"$f":"$B9*samband_HP_H_1!E9","v":{"v":0,"d":"0.0000"}},{"$f":"$B9*samband_HP_H_1!I9","v":{"v":0,"d":"0.0000"}},{"$f":"$B9*samband_HP_H_2!E9","v":{"v":0,"d":"0.0000"}}]
["arsenik(V)oxid",{"$f":"Indata!H11","v":{"v":0,"d":"0.0000"}},"nej",{"$f":"$B10*samband_HP_H_1!J10","v":{"v":0,"d":"0.0000"}},{"$f":"$B10*samband_HP_H_1!O10","v":{"v":0,"d":"0.0000"}},{"$f":"$B10*IF(samband_HP_H_1!Q10=1,1,0)","v":{"v":0,"d":"0.0000"}},{"$f":"$B10*(samband_HP_H_1!J10+samband_HP_H_1!K10+samband_HP_H_1!L10)","v":{"v":0,"d":"0.0000"}},{"$f":"$B10*samband_HP_H_1!E10","v":{"v":0,"d":"0.0000"}},{"$f":"$B10*samband_HP_H_1!I10","v":{"v":0,"d":"0.0000"}},{"$f":"$B10*samband_HP_H_2!E10","v":{"v":0,"d":"0.0000"}}]
["barium(II)oxid",{"$f":"Indata!H12","v":{"v":0,"d":"0.0000"}},"nej",{"$f":"$B11*samband_HP_H_1!J11","v":{"v":0,"d":"0.0000"}},{"$f":"$B11*samband_HP_H_1!O11","v":{"v":0,"d":"0.0000"}},{"$f":"$B11*IF(samband_HP_H_1!Q11=1,1,0)","v":{"v":0,"d":"0.0000"}},{"$f":"$B11*(samband_HP_H_1!J11+samband_HP_H_1!K11+samband_HP_H_1!L11)","v":{"v":0,"d":"0.0000"}},{"$f":"$B11*samband_HP_H_1!E11","v":{"v":0,"d":"0.0000"}},{"$f":"$B11*samband_HP_H_1!I11","v":{"v":0,"d":"0.0000"}},{"$f":"$B11*samband_HP_H_2!E11","v":{"v":0,"d":"0.0000"}}]
["bly(II)oxid",{"$f":"Indata!H13","v":{"v":0,"d":"0.0000"}},"nej",{"$f":"$B12*samband_HP_H_1!J12","v":{"v":0,"d":"0.0000"}},{"$f":"$B12*samband_HP_H_1!O12","v":{"v":0,"d":"0.0000"}},{"$f":"$B12*IF(samband_HP_H_1!Q12=1,1,0)","v":{"v":0,"d":"0.0000"}},{"$f":"$B12*(samband_HP_H_1!J12+samband_HP_H_1!K12+samband_HP_H_1!L12)","v":{"v":0,"d":"0.0000"}},{"$f":"$B12*samband_HP_H_1!E12","v":{"v":0,"d":"0.0000"}},{"$f":"$B12*samband_HP_H_1!I12","v":{"v":0,"d":"0.0000"}},{"$f":"$B12*samband_HP_H_2!E12","v":{"v":0,"d":"0.0000"}}]
["kobolt(II)oxid",{"$f":"Indata!H14","v":{"v":0,"d":"0.0000"}},"nej",{"$f":"$B13*samband_HP_H_1!J13","v":{"v":0,"d":"0.0000"}},{"$f":"$B13*samband_HP_H_1!O13","v":{"v":0,"d":"0.0000"}},{"$f":"$B13*IF(samband_HP_H_1!Q13=1,1,0)","v":{"v":0,"d":"0.0000"}},{"$f":"$B13*(samband_HP_H_1!J13+samband_HP_H_1!K13+samband_HP_H_1!L13)","v":{"v":0,"d":"0.0000"}},{"$f":"$B13*samband_HP_H_1!E13","v":{"v":0,"d":"0.0000"}},{"$f":"$B13*samband_HP_H_1!I13","v":{"v":0,"d":"0.0000"}},{"$f":"$B13*samband_HP_H_2!E13","v":{"v":0,"d":"0.0000"}}]
["koppar(II)oxid",{"$f":"Indata!H15","v":{"v":0,"d":"0.0000"}},"nej",{"$f":"$B14*samband_HP_H_1!J14","v":{"v":0,"d":"0.0000"}},{"$f":"$B14*samband_HP_H_1!O14","v":{"v":0,"d":"0.0000"}},{"$f":"$B14*IF(samband_HP_H_1!Q14=1,1,0)","v":{"v":0,"d":"0.0000"}},{"$f":"$B14*(samband_HP_H_1!J14+samband_HP_H_1!K14+samband_HP_H_1!L14)","v":{"v":0,"d":"0.0000"}},{"$f":"$B14*samband_HP_H_1!E14","v":{"v":0,"d":"0.0000"}},{"$f":"$B14*samband_HP_H_1!I14","v":{"v":0,"d":"0.0000"}},{"$f":"$B14*samband_HP_H_2!E14","v":{"v":0,"d":"0.0000"}}]
["CuFe2O4",{"$f":"Indata!H16","v":{"v":0,"d":"0.0000"}},"nej",{"$f":"$B15*samband_HP_H_1!J15","v":{"v":0,"d":"0.0000"}},{"$f":"$B15*samband_HP_H_1!O15","v":{"v":0,"d":"0.0000"}},{"$f":"$B15*IF(samband_HP_H_1!Q15=1,1,0)","v":{"v":0,"d":"0.0000"}},{"$f":"$B15*(samband_HP_H_1!J15+samband_HP_H_1!K15+samband_HP_H_1!L15)","v":{"v":0,"d":"0.0000"}},{"$f":"$B15*samband_HP_H_1!E15","v":{"v":0,"d":"0.0000"}},{"$f":"$B15*samband_HP_H_1!I15","v":{"v":0,"d":"0.0000"}},{"$f":"$B15*samband_HP_H_2!E15","v":{"v":0,"d":"0.0000"}}]
["krom(VI)oxid",{"$f":"Indata!H17","v":{"v":0,"d":"0.0000"}},"nej",{"$f":"$B16*samband_HP_H_1!J16","v":{"v":0,"d":"0.0000"}},{"$f":"$B16*samband_HP_H_1!O16","v":{"v":0,"d":"0.0000"}},{"$f":"$B16*IF(samband_HP_H_1!Q16=1,1,0)","v":{"v":0,"d":"0.0000"}},{"$f":"$B16*(samband_HP_H_1!J16+samband_HP_H_1!K16+samband_HP_H_1!L16)","v":{"v":0,"d":"0.0000"}},{"$f":"$B16*samband_HP_H_1!E16","v":{"v":0,"d":"0.0000"}},{"$f":"$B16*samband_HP_H_1!I16","v":{"v":0,"d":"0.0000"}},{"$f":"$B16*samband_HP_H_2!E16","v":{"v":0,"d":"0.0000"}}]
["krom(III)oxid",{"$f":"Indata!H18","v":{"v":0,"d":"0.0000"}},"nej",{"$f":"$B17*samband_HP_H_1!J17","v":{"v":0,"d":"0.0000"}},{"$f":"$B17*samband_HP_H_1!O17","v":{"v":0,"d":"0.0000"}},{"$f":"$B17*IF(samband_HP_H_1!Q17=1,1,0)","v":{"v":0,"d":"0.0000"}},{"$f":"$B17*(samband_HP_H_1!J17+samband_HP_H_1!K17+samband_HP_H_1!L17)","v":{"v":0,"d":"0.0000"}},{"$f":"$B17*samband_HP_H_1!E17","v":{"v":0,"d":"0.0000"}},{"$f":"$B17*samband_HP_H_1!I17","v":{"v":0,"d":"0.0000"}},{"$f":"$B17*samband_HP_H_2!E17","v":{"v":0,"d":"0.0000"}}]
["molybden(VI)oxid",{"$f":"Indata!H19","v":{"v":0,"d":"0.0000"}},"nej",{"$f":"$B18*samband_HP_H_1!J18","v":{"v":0,"d":"0.0000"}},{"$f":"$B18*samband_HP_H_1!O18","v":{"v":0,"d":"0.0000"}},{"$f":"$B18*IF(samband_HP_H_1!Q18=1,1,0)","v":{"v":0,"d":"0.0000"}},{"$f":"$B18*(samband_HP_H_1!J18+samband_HP_H_1!K18+samband_HP_H_1!L18)","v":{"v":0,"d":"0.0000"}},{"$f":"$B18*samband_HP_H_1!E18","v":{"v":0,"d":"0.0000"}},{"$f":"$B18*samband_HP_H_1!I18","v":{"v":0,"d":"0.0000"}},{"$f":"$B18*samband_HP_H_2!E18","v":{"v":0,"d":"0.0000"}}]
["nickel(II)oxid",{"$f":"Indata!H20","v":{"v":0,"d":"0.0000"}},"nej",{"$f":"$B19*samband_HP_H_1!J19","v":{"v":0,"d":"0.0000"}},{"$f":"$B19*samband_HP_H_1!O19","v":{"v":0,"d":"0.0000"}},{"$f":"$B19*IF(samband_HP_H_1!Q19=1,1,0)","v":{"v":0,"d":"0.0000"}},{"$f":"$B19*(samband_HP_H_1!J19+samband_HP_H_1!K19+samband_HP_H_1!L19)","v":{"v":0,"d":"0.0000"}},{"$f":"$B19*samband_HP_H_1!E19","v":{"v":0,"d":"0.0000"}},{"$f":"$B19*samband_HP_H_1!I19","v":{"v":0,"d":"0.0000"}},{"$f":"$B19*samband_HP_H_2!E19","v":{"v":0,"d":"0.0000"}}]
["NiFe2O4",{"$f":"Indata!H21","v":{"v":0,"d":"0.0000"}},"nej",{"$f":"$B20*samband_HP_H_1!J20","v":{"v":0,"d":"0.0000"}},{"$f":"$B20*samband_HP_H_1!O20","v":{"v":0,"d":"0.0000"}},{"$f":"$B20*IF(samband_HP_H_1!Q20=1,1,0)","v":{"v":0,"d":"0.0000"}},{"$f":"$B20*(samband_HP_H_1!J20+samband_HP_H_1!K20+samband_HP_H_1!L20)","v":{"v":0,"d":"0.0000"}},{"$f":"$B20*samband_HP_H_1!E20","v":{"v":0,"d":"0.0000"}},{"$f":"$B20*samband_HP_H_1!I20","v":{"v":0,"d":"0.0000"}},{"$f":"$B20*samband_HP_H_2!E20","v":{"v":0,"d":"0.0000"}}]
["vanadin(V)oxid",{"$f":"Indata!H22","v":{"v":0,"d":"0.0000"}},"nej",{"$f":"$B21*samband_HP_H_1!J21","v":{"v":0,"d":"0.0000"}},{"$f":"$B21*samband_HP_H_1!O21","v":{"v":0,"d":"0.0000"}},{"$f":"$B21*IF(samband_HP_H_1!Q21=1,1,0)","v":{"v":0,"d":"0.0000"}},{"$f":"$B21*(samband_HP_H_1!J21+samband_HP_H_1!K21+samband_HP_H_1!L21)","v":{"v":0,"d":"0.0000"}},{"$f":"$B21*samband_HP_H_1!E21","v":{"v":0,"d":"0.0000"}},{"$f":"$B21*samband_HP_H_1!I21","v":{"v":0,"d":"0.0000"}},{"$f":"$B21*samband_HP_H_2!E21","v":{"v":0,"d":"0.0000"}}]
["FeV2O4",{"$f":"Indata!H23","v":{"v":0,"d":"0.0000"}},"nej",{"$f":"$B22*samband_HP_H_1!J22","v":{"v":0,"d":"0.0000"}},{"$f":"$B22*samband_HP_H_1!O22","v":{"v":0,"d":"0.0000"}},{"$f":"$B22*IF(samband_HP_H_1!Q22=1,1,0)","v":{"v":0,"d":"0.0000"}},{"$f":"$B22*(samband_HP_H_1!J22+samband_HP_H_1!K22+samband_HP_H_1!L22)","v":{"v":0,"d":"0.0000"}},{"$f":"$B22*samband_HP_H_1!E22","v":{"v":0,"d":"0.0000"}},{"$f":"$B22*samband_HP_H_1!I22","v":{"v":0,"d":"0.0000"}},{"$f":"$B22*samband_HP_H_2!E22","v":{"v":0,"d":"0.0000"}}]
["volfram(VI)oxid",{"$f":"Indata!H24","v":{"v":0,"d":"0.0000"}},"nej",{"$f":"$B23*samband_HP_H_1!J23","v":{"v":0,"d":"0.0000"}},{"$f":"$B23*samband_HP_H_1!O23","v":{"v":0,"d":"0.0000"}},{"$f":"$B23*IF(samband_HP_H_1!Q23=1,1,0)","v":{"v":0,"d":"0.0000"}},{"$f":"$B23*(samband_HP_H_1!J23+samband_HP_H_1!K23+samband_HP_H_1!L23)","v":{"v":0,"d":"0.0000"}},{"$f":"$B23*samband_HP_H_1!E23","v":{"v":0,"d":"0.0000"}},{"$f":"$B23*samband_HP_H_1!I23","v":{"v":0,"d":"0.0000"}},{"$f":"$B23*samband_HP_H_2!E23","v":{"v":0,"d":"0.0000"}}]
["zink(II)oxid",{"$f":"Indata!H25","v":{"v":0,"d":"0.0000"}},"nej",{"$f":"$B24*samband_HP_H_1!J24","v":{"v":0,"d":"0.0000"}},{"$f":"$B24*samband_HP_H_1!O24","v":{"v":0,"d":"0.0000"}},{"$f":"$B24*IF(samband_HP_H_1!Q24=1,1,0)","v":{"v":0,"d":"0.0000"}},{"$f":"$B24*(samband_HP_H_1!J24+samband_HP_H_1!K24+samband_HP_H_1!L24)","v":{"v":0,"d":"0.0000"}},{"$f":"$B24*samband_HP_H_1!E24","v":{"v":0,"d":"0.0000"}},{"$f":"$B24*samband_HP_H_1!I24","v":{"v":0,"d":"0.0000"}},{"$f":"$B24*samband_HP_H_2!E24","v":{"v":0,"d":"0.0000"}}]
["ZnFe2O4",{"$f":"Indata!H26","v":{"v":0,"d":"0.0000"}},"nej",{"$f":"$B25*samband_HP_H_1!J25","v":{"v":0,"d":"0.0000"}},{"$f":"$B25*samband_HP_H_1!O25","v":{"v":0,"d":"0.0000"}},{"$f":"$B25*IF(samband_HP_H_1!Q25=1,1,0)","v":{"v":0,"d":"0.0000"}},{"$f":"$B25*(samband_HP_H_1!J25+samband_HP_H_1!K25+samband_HP_H_1!L25)","v":{"v":0,"d":"0.0000"}},{"$f":"$B25*samband_HP_H_1!E25","v":{"v":0,"d":"0.0000"}},{"$f":"$B25*samband_HP_H_1!I25","v":{"v":0,"d":"0.0000"}},{"$f":"$B25*samband_HP_H_2!E25","v":{"v":0,"d":"0.0000"}}]
["kadmium(II)klorid",{"$f":"Indata!H27","v":{"v":0,"d":"0.0000"}},"nej",{"$f":"$B26*samband_HP_H_1!J26","v":{"v":0,"d":"0.0000"}},{"$f":"$B26*samband_HP_H_1!O26","v":{"v":0,"d":"0.0000"}},{"$f":"$B26*IF(samband_HP_H_1!Q26=1,1,0)","v":{"v":0,"d":"0.0000"}},{"$f":"$B26*(samband_HP_H_1!J26+samband_HP_H_1!K26+samband_HP_H_1!L26)","v":{"v":0,"d":"0.0000"}},{"$f":"$B26*samband_HP_H_1!E26","v":{"v":0,"d":"0.0000"}},{"$f":"$B26*samband_HP_H_1!I26","v":{"v":0,"d":"0.0000"}},{"$f":"$B26*samband_HP_H_2!E26","v":{"v":0,"d":"0.0000"}}]
["kvicksilver(II)klorid",{"$f":"Indata!H28","v":{"v":0,"d":"0.0000"}},{"$f":"IF(B27>1,\"ja\",\"nej\")","v":"nej"},{"$f":"$B27*samband_HP_H_1!J27","v":{"v":0,"d":"0.0000"}},{"$f":"$B27*samband_HP_H_1!O27","v":{"v":0,"d":"0.0000"}},{"$f":"$B27*IF(samband_HP_H_1!Q27=1,1,0)","v":{"v":0,"d":"0.0000"}},{"$f":"$B27*(samband_HP_H_1!J27+samband_HP_H_1!K27+samband_HP_H_1!L27)","v":{"v":0,"d":"0.0000"}},{"$f":"$B27*samband_HP_H_1!E27","v":{"v":0,"d":"0.0000"}},{"$f":"$B27*samband_HP_H_1!I27","v":{"v":0,"d":"0.0000"}},{"$f":"$B27*samband_HP_H_2!E27","v":{"v":0,"d":"0.0000"}}]
["ammoniak",{"$f":"Indata!H29","v":{"v":0,"d":"0.0000"}},{"$f":"IF(B28>1,\"ja\",\"nej\")","v":"nej"},{"$f":"$B28*samband_HP_H_1!J28","v":{"v":0,"d":"0.0000"}},{"$f":"$B28*samband_HP_H_1!O28","v":{"v":0,"d":"0.0000"}},{"$f":"$B28*IF(samband_HP_H_1!Q28=1,1,0)","v":{"v":0,"d":"0.0000"}},{"$f":"$B28*(samband_HP_H_1!J28+samband_HP_H_1!K28+samband_HP_H_1!L28)","v":{"v":0,"d":"0.0000"}},{"$f":"$B28*samband_HP_H_1!E28","v":{"v":0,"d":"0.0000"}},{"$f":"$B28*samband_HP_H_1!I28","v":{"v":0,"d":"0.0000"}},{"$f":"$B28*samband_HP_H_2!E28","v":{"v":0,"d":"0.0000"}}]
["Summa totalt",null,null,{"$f":"SUM(D8:D28)","v":{"v":0,"d":"0.0000"}},{"v":0,"d":"0.0000"},{"v":0,"d":"0.0000"},{"v":0,"d":"0.0000"},{"v":0,"d":"0.0000"},{"v":0,"d":"0.0000"},{"v":0,"d":"0.0000"}]
["Summa utan de < 1 %",null,null,{"$f":"SUMIF($C8:$C28,\"ja\",D8:D28)","v":{"v":0,"d":"0.0000"}},{"$f":"SUMIF($C8:$C28,\"ja\",E8:E28)","v":{"v":0,"d":"0.0000"}},{"v":0,"d":"0.0000"},{"v":0,"d":"0.0000"},{"v":0,"d":"0.0000"},{"v":0,"d":"0.0000"},{"v":0,"d":"0.0000"}]
["Gräns %",null,null,1,10,20,5,25,55,22.5]
["Farligt avfall?",null,null,{"$f":"IF(D30<D31,0,1)","v":0},0,0,0,0,0,0]

{"sheet":"HP_6B","index":6,"n_rows":32,"n_cols":12,"rows_kept":32}
[]
[]
["Kalkyler för resten av HP 6"]
[]
["Avfallsfarlighet","För",null,"HP6","HP6","HP6","HP6","HP6","HP6","HP6","HP6","HP6"]
["Faroangivelse","kalkyl","> 0,1 %","H300","H300","H310","H310","H330","H330","H301","H311","H331"]
["Farokategori","%",null,1,2,1,2,1,2]
["antimon(III)oxid",{"$f":"Indata!H9","v":{"v":0,"d":"0.0000"}},{"$f":"IF(B8>0.1,\"ja\",\"nej\")","v":"nej"},{"$f":"$B8*samband_HP_H_1!B8","v":{"v":0,"d":"0.0000"}},{"$f":"$B8*samband_HP_H_1!C8","v":{"v":0,"d":"0.0000"}},{"$f":"$B8*samband_HP_H_1!F8","v":{"v":0,"d":"0.0000"}},{"$f":"$B8*samband_HP_H_1!G8","v":{"v":0,"d":"0.0000"}},{"$f":"$B8*samband_HP_H_2!B8","v":{"v":0,"d":"0.0000"}},{"$f":"$B8*samband_HP_H_2!C8","v":{"v":0,"d":"0.0000"}},{"$f":"$B8*samband_HP_H_1!D8","v":{"v":0,"d":"0.0000"}},{"$f":"$B8*samband_HP_H_1!H8","v":{"v":0,"d":"0.0000"}},{"$f":"$B8*samband_HP_H_2!D8","v":{"v":0,"d":"0.0000"}}]
["arsenik(III)oxid",{"$f":"Indata!H10","v":{"v":0,"d":"0.0000"}},{"$f":"IF(B9>0.1,\"ja\",\"nej\")","v":"nej"},{"$f":"$B9*samband_HP_H_1!B9","v":{"v":0,"d":"0.0000"}},{"$f":"$B9*samband_HP_H_1!C9","v":{"v":0,"d":"0.0000"}},{"$f":"$B9*samband_HP_H_1!F9","v":{"v":0,"d":"0.0000"}},{"$f":"$B9*samband_HP_H_1!G9","v":{"v":0,"d":"0.0000"}},{"$f":"$B9*samband_HP_H_2!B9","v":{"v":0,"d":"0.0000"}},{"$f":"$B9*samband_HP_H_2!C9","v":{"v":0,"d":"0.0000"}},{"$f":"$B9*samband_HP_H_1!D9","v":{"v":0,"d":"0.0000"}},{"$f":"$B9*samband_HP_H_1!H9","v":{"v":0,"d":"0.0000"}},{"$f":"$B9*samband_HP_H_2!D9","v":{"v":0,"d":"0.0000"}}]
["arsenik(V)oxid",{"$f":"Indata!H11","v":{"v":0,"d":"0.0000"}},"nej",{"$f":"$B10*samband_HP_H_1!B10","v":{"v":0,"d":"0.0000"}},{"$f":"$B10*samband_HP_H_1!C10","v":{"v":0,"d":"0.0000"}},{"$f":"$B10*samband_HP_H_1!F10","v":{"v":0,"d":"0.0000"}},{"$f":"$B10*samband_HP_H_1!G10","v":{"v":0,"d":"0.0000"}},{"$f":"$B10*samband_HP_H_2!B10","v":{"v":0,"d":"0.0000"}},{"$f":"$B10*samband_HP_H_2!C10","v":{"v":0,"d":"0.0000"}},{"$f":"$B10*samband_HP_H_1!D10","v":{"v":0,"d":"0.0000"}},{"$f":"$B10*samband_HP_H_1!H10","v":{"v":0,"d":"0.0000"}},{"$f":"$B10*samband_HP_H_2!D10","v":{"v":0,"d":"0.0000"}}]
["barium(II)oxid",{"$f":"Indata!H12","v":{"v":0,"d":"0.0000"}},"nej",{"$f":"$B11*samband_HP_H_1!B11","v":{"v":0,"d":"0.0000"}},{"$f":"$B11*samband_HP_H_1!C11","v":{"v":0,"d":"0.0000"}},{"$f":"$B11*samband_HP_H_1!F11","v":{"v":0,"d":"0.0000"}},{"$f":"$B11*samband_HP_H_1!G11","v":{"v":0,"d":"0.0000"}},{"$f":"$B11*samband_HP_H_2!B11","v":{"v":0,"d":"0.0000"}},{"$f":"$B11*samband_HP_H_2!C11","v":{"v":0,"d":"0.0000"}},{"$f":"$B11*samband_HP_H_1!D11","v":{"v":0,"d":"0.0000"}},{"$f":"$B11*samband_HP_H_1!H11","v":{"v":0,"d":"0.0000"}},{"$f":"$B11*samband_HP_H_2!D11","v":{"v":0,"d":"0.0000"}}]
["bly(II)oxid",{"$f":"Indata!H13","v":{"v":0,"d":"0.0000"}},"nej",{"$f":"$B12*samband_HP_H_1!B12","v":{"v":0,"d":"0.0000"}},{"$f":"$B12*samband_HP_H_1!C12","v":{"v":0,"d":"0.0000"}},{"$f":"$B12*samband_HP_H_1!F12","v":{"v":0,"d":"0.0000"}},{"$f":"$B12*samband_HP_H_1!G12","v":{"v":0,"d":"0.0000"}},{"$f":"$B12*samband_HP_H_2!B12","v":{"v":0,"d":"0.0000"}},{"$f":"$B12*samband_HP_H_2!C12","v":{"v":0,"d":"0.0000"}},{"$f":"$B12*samband_HP_H_1!D12","v":{"v":0,"d":"0.0000"}},{"$f":"$B12*samband_HP_H_1!H12","v":{"v":0,"d":"0.0000"}},{"$f":"$B12*samband_HP_H_2!D12","v":{"v":0,"d":"0.0000"}}]
["kobolt(II)oxid",{"$f":"Indata!H14","v":{"v":0,"d":"0.0000"}},"nej",{"$f":"$B13*samband_HP_H_1!B13","v":{"v":0,"d":"0.0000"}},{"$f":"$B13*samband_HP_H_1!C13","v":{"v":0,"d":"0.0000"}},{"$f":"$B13*samband_HP_H_1!F13","v":{"v":0,"d":"0.0000"}},{"$f":"$B13*samband_HP_H_1!G13","v":{"v":0,"d":"0.0000"}},{"$f":"$B13*samband_HP_H_2!B13","v":{"v":0,"d":"0.0000"}},{"$f":"$B13*samband_HP_H_2!C13","v":{"v":0,"d":"0.0000"}},{"$f":"$B13*samband_HP_H_1!D13","v":{"v":0,"d":"0.0000"}},{"$f":"$B13*samband_HP_H_1!H13","v":{"v":0,"d":"0.0000"}},{"$f":"$B13*samband_HP_H_2!D13","v":{"v":0,"d":"0.0000"}}]
["koppar(II)oxid",{"$f":"Indata!H15","v":{"v":0,"d":"0.0000"}},"nej",{"$f":"$B14*samband_HP_H_1!B14","v":{"v":0,"d":"0.0000"}},{"$f":"$B14*samband_HP_H_1!C14","v":{"v":0,"d":"0.0000"}},{"$f":"$B14*samband_HP_H_1!F14","v":{"v":0,"d":"0.0000"}},{"$f":"$B14*samband_HP_H_1!G14","v":{"v":0,"d":"0.0000"}},{"$f":"$B14*samband_HP_H_2!B14","v":{"v":0,"d":"0.0000"}},{"$f":"$B14*samband_HP_H_2!C14","v":{"v":0,"d":"0.0000"}},{"$f":"$B14*samband_HP_H_1!D14","v":{"v":0,"d":"0.0000"}},{"$f":"$B14*samband_HP_H_1!H14","v":{"v":0,"d":"0.0000"}},{"$f":"$B14*samband_HP_H_2!D14","v":{"v":0,"d":"0.0000"}}]
["CuFe2O4",{"$f":"Indata!H16","v":{"v":0,"d":"0.0000"}},"nej",{"$f":"$B15*samband_HP_H_1!B15","v":{"v":0,"d":"0.0000"}},{"$f":"$B15*samband_HP_H_1!C15","v":{"v":0,"d":"0.0000"}},{"$f":"$B15*samband_HP_H_1!F15","v":{"v":0,"d":"0.0000"}},{"$f":"$B15*samband_HP_H_1!G15","v":{"v":0,"d":"0.0000"}},{"$f":"$B15*samband_HP_H_2!B15","v":{"v":0,"d":"0.0000"}},{"$f":"$B15*samband_HP_H_2!C15","v":{"v":0,"d":"0.0000"}},{"$f":"$B15*samband_HP_H_1!D15","v":{"v":0,"d":"0.0000"}},{"$f":"$B15*samband_HP_H_1!H15","v":{"v":0,"d":"0.0000"}},{"$f":"$B15*samband_HP_H_2!D15","v":{"v":0,"d":"0.0000"}}]
["krom(VI)oxid",{"$f":"Indata!H17","v":{"v":0,"d":"0.0000"}},"nej",{"$f":"$B16*samband_HP_H_1!B16","v":{"v":0,"d":"0.0000"}},{"$f":"$B16*samband_HP_H_1!C16","v":{"v":0,"d":"0.0000"}},{"$f":"$B16*samband_HP_H_1!F16","v":{"v":0,"d":"0.0000"}},{"$f":"$B16*samband_HP_H_1!G16","v":{"v":0,"d":"0.0000"}},{"$f":"$B16*samband_HP_H_2!B16","v":{"v":0,"d":"0.0000"}},{"$f":"$B16*samband_HP_H_2!C16","v":{"v":0,"d":"0.0000"}},{"$f":"$B16*samband_HP_H_1!D16","v":{"v":0,"d":"0.0000"}},{"$f":"$B16*samband_HP_H_1!H16","v":{"v":0,"d":"0.0000"}},{"$f":"$B16*samband_HP_H_2!D16","v":{"v":0,"d":"0.0000"}}]
["krom(III)oxid",{"$f":"Indata!H18","v":{"v":0,"d":"0.0000"}},"nej",{"$f":"$B17*samband_HP_H_1!B17","v":{"v":0,"d":"0.0000"}},{"$f":"$B17*samband_HP_H_1!C17","v":{"v":0,"d":"0.0000"}},{"$f":"$B17*samband_HP_H_1!F17","v":{"v":0,"d":"0.0000"}},{"$f":"$B17*samband_HP_H_1!G17","v":{"v":0,"d":"0.0000"}},{"$f":"$B17*samband_HP_H_2!B17","v":{"v":0,"d":"0.0000"}},{"$f":"$B17*samband_HP_H_2!C17","v":{"v":0,"d":"0.0000"}},{"$f":"$B17*samband_HP_H_1!D17","v":{"v":0,"d":"0.0000"}},{"$f":"$B17*samband_HP_H_1!H17","v":{"v":0,"d":"0.0000"}},{"$f":"$B17*samband_HP_H_2!D17","v":{"v":0,"d":"0.0000"}}]
["molybden(VI)oxid",{"$f":"Indata!H19","v":{"v":0,"d":"0.0000"}},"nej",{"$f":"$B18*samband_HP_H_1!B18","v":{"v":0,"d":"0.0000"}},{"$f":"$B18*samband_HP_H_1!C18","v":{"v":0,"d":"0.0000"}},{"$f":"$B18*samband_HP_H_1!F18","v":{"v":0,"d":"0.0000"}},{"$f":"$B18*samband_HP_H_1!G18","v":{"v":0,"d":"0.0000"}},{"$f":"$B18*samband_HP_H_2!B18","v":{"v":0,"d":"0.0000"}},{"$f":"$B18*samband_HP_H_2!C18","v":{"v":0,"d":"0.0000"}},{"$f":"$B18*samband_HP_H_1!D18","v":{"v":0,"d":"0.0000"}},{"$f":"$B18*samband_HP_H_1!H18","v":{"v":0,"d":"0.0000"}},{"$f":"$B18*samband_HP_H_2!D18","v":{"v":0,"d":"0.0000"}}]
["nickel(II)oxid",{"$f":"Indata!H20","v":{"v":0,"d":"0.0000"}},"nej",{"$f":"$B19*samband_HP_H_1!B19","v":{"v":0,"d":"0.0000"}},{"$f":"$B19*samband_HP_H_1!C19","v":{"v":0,"d":"0.0000"}},{"$f":"$B19*samband_HP_H_1!F19","v":{"v":0,"d":"0.0000"}},{"$f":"$B19*samband_HP_H_1!G19","v":{"v":0,"d":"0.0000"}},{"$f":"$B19*samband_HP_H_2!B19","v":{"v":0,"d":"0.0000"}},{"$f":"$B19*samband_HP_H_2!C19","v":{"v":0,"d":"0.0000"}},{"$f":"$B19*samband_HP_H_1!D19","v":{"v":0,"d":"0.0000"}},{"$f":"$B19*samband_HP_H_1!H19","v":{"v":0,"d":"0.0000"}},{"$f":"$B19*samband_HP_H_2!D19","v":{"v":0,"d":"0.0000"}}]
["NiFe2O4",{"$f":"Indata!H21","v":{"v":0,"d":"0.0000"}},"nej",{"$f":"$B20*samband_HP_H_1!B20","v":{"v":0,"d":"0.0000"}},{"$f":"$B20*samband_HP_H_1!C20","v":{"v":0,"d":"0.0000"}},{"$f":"$B20*samband_HP_H_1!F20","v":{"v":0,"d":"0.0000"}},{"$f":"$B20*samband_HP_H_1!G20","v":{"v":0,"d":"0.0000"}},{"$f":"$B20*samband_HP_H_2!B20","v":{"v":0,"d":"0.0000"}},{"$f":"$B20*samband_HP_H_2!C20","v":{"v":0,"d":"0.0000"}},{"$f":"$B20*samband_HP_H_1!D20","v":{"v":0,"d":"0.0000"}},{"$f":"$B20*samband_HP_H_1!H20","v":{"v":0,"d":"0.0000"}},{"$f":"$B20*samband_HP_H_2!D20","v":{"v":0,"d":"0.0000"}}]
["vanadin(V)oxid",{"$f":"Indata!H22","v":{"v":0,"d":"0.0000"}},"nej",{"$f":"$B21*samband_HP_H_1!B21","v":{"v":0,"d":"0.0000"}},{"$f":"$B21*samband_HP_H_1!C21","v":{"v":0,"d":"0.0000"}},{"$f":"$B21*samband_HP_H_1!F21","v":{"v":0,"d":"0.0000"}},{"$f":"$B21*samband_HP_H_1!G21","v":{"v":0,"d":"0.0000"}},{"$f":"$B21*samband_HP_H_2!B21","v":{"v":0,"d":"0.0000"}},{"$f":"$B21*samband_HP_H_2!C21","v":{"v":0,"d":"0.0000"}},{"$f":"$B21*samband_HP_H_1!D21","v":{"v":0,"d":"0.0000"}},{"$f":"$B21*samband_HP_H_1!H21","v":{"v":0,"d":"0.0000"}},{"$f":"$B21*samband_HP_H_2!D21","v":{"v":0,"d":"0.0000"}}]
["FeV2O4",{"$f":"Indata!H23","v":{"v":0,"d":"0.0000"}},"nej",{"$f":"$B22*samband_HP_H_1!B22","v":{"v":0,"d":"0.0000"}},{"$f":"$B22*samband_HP_H_1!C22","v":{"v":0,"d":"0.0000"}},{"$f":"$B22*samband_HP_H_1!F22","v":{"v":0,"d":"0.0000"}},{"$f":"$B22*samband_HP_H_1!G22","v":{"v":0,"d":"0.0000"}},{"$f":"$B22*samband_HP_H_2!B22","v":{"v":0,"d":"0.0000"}},{"$f":"$B22*samband_HP_H_2!C22","v":{"v":0,"d":"0.0000"}},{"$f":"$B22*samband_HP_H_1!D22","v":{"v":0,"d":"0.0000"}},{"$f":"$B22*samband_HP_H_1!H22","v":{"v":0,"d":"0.0000"}},{"$f":"$B22*samband_HP_H_2!D22","v":{"v":0,"d":"0.0000"}}]
["volfram(VI)oxid",{"$f":"Indata!H24","v":{"v":0,"d":"0.0000"}},"nej",{"$f":"$B23*samband_HP_H_1!B23","v":{"v":0,"d":"0.0000"}},{"$f":"$B23*samband_HP_H_1!C23","v":{"v":0,"d":"0.0000"}},{"$f":"$B23*samband_HP_H_1!F23","v":{"v":0,"d":"0.0000"}},{"$f":"$B23*samband_HP_H_1!G23","v":{"v":0,"d":"0.0000"}},{"$f":"$B23*samband_HP_H_2!B23","v":{"v":0,"d":"0.0000"}},{"$f":"$B23*samband_HP_H_2!C23","v":{"v":0,"d":"0.0000"}},{"$f":"$B23*samband_HP_H_1!D23","v":{"v":0,"d":"0.0000"}},{"$f":"$B23*samband_HP_H_1!H23","v":{"v":0,"d":"0.0000"}},{"$f":"$B23*samband_HP_H_2!D23","v":{"v":0,"d":"0.0000"}}]
["zink(II)oxid",{"$f":"Indata!H25","v":{"v":0,"d":"0.0000"}},"nej",{"$f":"$B24*samband_HP_H_1!B24","v":{"v":0,"d":"0.0000"}},{"$f":"$B24*samband_HP_H_1!C24","v":{"v":0,"d":"0.0000"}},{"$f":"$B24*samband_HP_H_1!F24","v":{"v":0,"d":"0.0000"}},{"$f":"$B24*samband_HP_H_1!G24","v":{"v":0,"d":"0.0000"}},{"$f":"$B24*samband_HP_H_2!B24","v":{"v":0,"d":"0.0000"}},{"$f":"$B24*samband_HP_H_2!C24","v":{"v":0,"d":"0.0000"}},{"$f":"$B24*samband_HP_H_1!D24","v":{"v":0,"d":"0.0000"}},{"$f":"$B24*samband_HP_H_1!H24","v":{"v":0,"d":"0.0000"}},{"$f":"$B24*samband_HP_H_2!D24","v":{"v":0,"d":"0.0000"}}]
["ZnFe2O4",{"$f":"Indata!H26","v":{"v":0,"d":"0.0000"}},"nej",{"$f":"$B25*samband_HP_H_1!B25","v":{"v":0,"d":"0.0000"}},{"$f":"$B25*samband_HP_H_1!C25","v":{"v":0,"d":"0.0000"}},{"$f":"$B25*samband_HP_H_1!F25","v":{"v":0,"d":"0.0000"}},{"$f":"$B25*samband_HP_H_1!G25","v":{"v":0,"d":"0.0000"}},{"$f":"$B25*samband_HP_H_2!B25","v":{"v":0,"d":"0.0000"}},{"$f":"$B25*samband_HP_H_2!C25","v":{"v":0,"d":"0.0000"}},{"$f":"$B25*samband_HP_H_1!D25","v":{"v":0,"d":"0.0000"}},{"$f":"$B25*samband_HP_H_1!H25","v":{"v":0,"d":"0.0000"}},{"$f":"$B25*samband_HP_H_2!D25","v":{"v":0,"d":"0.0000"}}]
["kadmium(II)klorid",{"$f":"Indata!H27","v":{"v":0,"d":"0.0000"}},"nej",{"$f":"$B26*samband_HP_H_1!B26","v":{"v":0,"d":"0.0000"}},{"$f":"$B26*samband_HP_H_1!C26","v":{"v":0,"d":"0.0000"}},{"$f":"$B26*samband_HP_H_1!F26","v":{"v":0,"d":"0.0000"}},{"$f":"$B26*samband_HP_H_1!G26","v":{"v":0,"d":"0.0000"}},{"$f":"$B26*samband_HP_H_2!B26","v":{"v":0,"d":"0.0000"}},{"$f":"$B26*samband_HP_H_2!C26","v":{"v":0,"d":"0.0000"}},{"$f":"$B26*samband_HP_H_1!D26","v":{"v":0,"d":"0.0000"}},{"$f":"$B26*samband_HP_H_1!H26","v":{"v":0,"d":"0.0000"}},{"$f":"$B26*samband_HP_H_2!D26","v":{"v":0,"d":"0.0000"}}]
["kvicksilver(II)klorid",{"$f":"Indata!H28","v":{"v":0,"d":"0.0000"}},{"$f":"IF(B27>0.1,\"ja\",\"nej\")","v":"nej"},{"$f":"$B27*samband_HP_H_1!B27","v":{"v":0,"d":"0.0000"}},{"$f":"$B27*samband_HP_H_1!C27","v":{"v":0,"d":"0.0000"}},{"$f":"$B27*samband_HP_H_1!F27","v":{"v":0,"d":"0.0000"}},{"$f":"$B27*samband_HP_H_1!G27","v":{"v":0,"d":"0.0000"}},{"$f":"$B27*samband_HP_H_2!B27","v":{"v":0,"d":"0.0000"}},{"$f":"$B27*samband_HP_H_2!C27","v":{"v":0,"d":"0.0000"}},{"$f":"$B27*samband_HP_H_1!D27","v":{"v":0,"d":"0.0000"}},{"$f":"$B27*samband_HP_H_1!H27","v":{"v":0,"d":"0.0000"}},{"$f":"$B27*samband_HP_H_2!D27","v":{"v":0,"d":"0.0000"}}]
["ammoniak",{"$f":"Indata!H29","v":{"v":0,"d":"0.0000"}},{"$f":"IF(B28>0.1,\"ja\",\"nej\")","v":"nej"},{"$f":"$B28*samband_HP_H_1!B28","v":{"v":0,"d":"0.0000"}},{"$f":"$B28*samband_HP_H_1!C28","v":{"v":0,"d":"0.0000"}},{"$f":"$B28*samband_HP_H_1!F28","v":{"v":0,"d":"0.0000"}},{"$f":"$B28*samband_HP_H_1!G28","v":{"v":0,"d":"0.0000"}},{"$f":"$B28*samband_HP_H_2!B28","v":{"v":0,"d":"0.0000"}},{"$f":"$B28*samband_HP_H_2!C28","v":{"v":0,"d":"0.0000"}},{"$f":"$B28*samband_HP_H_1!D28","v":{"v":0,"d":"0.0000"}},{"$f":"$B28*samband_HP_H_1!H28","v":{"v":0,"d":"0.0000"}},{"$f":"$B28*samband_HP_H_2!D28","v":{"v":0,"d":"0.0000"}}]
["Summa totalt",null,null,{"$f":"SUM(D8:D28)","v":{"v":0,"d":"0.0000"}},{"v":0,"d":"0.0000"},{"v":0,"d":"0.0000"},{"v":0,"d":"0.0000"},{"v":0,"d":"0.0000"},{"v":0,"d":"0.0000"},{"v":0,"d":"0.0000"},{"v":0,"d":"0.0000"},{"v":0,"d":"0.0000"}]
["Summa utan de < 0,1 %",null,null,{"$f":"SUMIF($C8:$C28,\"ja\",D8:D28)","v":{"v":0,"d":"0.0000"}},{"$f":"SUMIF($C8:$C28,\"ja\",E8:E28)","v":{"v":0,"d":"0.0000"}},{"v":0,"d":"0.0000"},{"v":0,"d":"0.0000"},{"v":0,"d":"0.0000"},{"v":0,"d":"0.0000"},{"v":0,"d":"0.0000"},{"$f":"SUMIF($C8:$C28,\"ja\",K8:K28)","v":{"v":0,"d":"0.0000"}},{"$f":"SUMIF($C8:$C28,\"ja\",L8:L28)","v":{"v":0,"d":"0.0000"}}]
["Gräns %",null,null,0.1,0.25,0.25,2.5,0.1,0.5,5,15,3.5]
["Farligt avfall?",null,null,{"$f":"IF(D30<D31,0,1)","v":0},0,0,0,0,0,0,0,0]

{"sheet":"HP_5_7_10_11_13","index":7,"n_rows":31,"n_cols":15,"rows_kept":31}
[]
[]
["Kalkyler för HP 5, HP 7, HP 10, HP 11 och HP 13"]
[]
["Avfallsfarlighet","För","HP5","HP5","HP5","HP5","HP5","HP7","HP7","HP10","HP10","HP11","HP11","HP13","HP13"]
["Faroangivelse","kalkyl","H370","H371","H335","H372","H373","H350","H351","H360","H361","H340","H341","H334","H317"]
["Farokategori","%"]
["antimon(III)oxid",{"$f":"Indata!H9","v":{"v":0,"d":"0.0000"}},{"$f":"$B8*samband_HP_H_2!N8","v":{"v":0,"d":"0.0000"}},{"$f":"$B8*samband_HP_H_2!O8","v":{"v":0,"d":"0.0000"}},{"$f":"$B8*samband_HP_H_2!G8","v":{"v":0,"d":"0.0000"}},{"$f":"$B8*samband_HP_H_2!P8","v":{"v":0,"d":"0.0000"}},{"$f":"$B8*samband_HP_H_2!Q8","v":{"v":0,"d":"0.0000"}},{"$f":"$B8*samband_HP_H_2!J8","v":{"v":0,"d":"0.0000"}},{"$f":"$B8*samband_HP_H_2!K8","v":{"v":0,"d":"0.0000"}},{"$f":"$B8*samband_HP_H_2!L8","v":{"v":0,"d":"0.0000"}},{"$f":"$B8*samband_HP_H_2!M8","v":{"v":0,"d":"0.0000"}},{"$f":"$B8*samband_HP_H_2!H8","v":{"v":0,"d":"0.0000"}},{"$f":"$B8*samband_HP_H_2!I8","v":{"v":0,"d":"0.0000"}},{"$f":"$B8*samband_HP_H_2!F8","v":{"v":0,"d":"0.0000"}},{"$f":"$B8*samband_HP_H_1!N8","v":{"v":0,"d":"0.0000"}}]
["arsenik(III)oxid",{"$f":"Indata!H10","v":{"v":0,"d":"0.0000"}},{"$f":"$B9*samband_HP_H_2!N9","v":{"v":0,"d":"0.0000"}},{"$f":"$B9*samband_HP_H_2!O9","v":{"v":0,"d":"0.0000"}},{"$f":"$B9*samband_HP_H_2!G9","v":{"v":0,"d":"0.0000"}},{"$f":"$B9*samband_HP_H_2!P9","v":{"v":0,"d":"0.0000"}},{"$f":"$B9*samband_HP_H_2!Q9","v":{"v":0,"d":"0.0000"}},{"$f":"$B9*samband_HP_H_2!J9","v":{"v":0,"d":"0.0000"}},{"$f":"$B9*samband_HP_H_2!K9","v":{"v":0,"d":"0.0000"}},{"$f":"$B9*samband_HP_H_2!L9","v":{"v":0,"d":"0.0000"}},{"$f":"$B9*samband_HP_H_2!M9","v":{"v":0,"d":"0.0000"}},{"$f":"$B9*samband_HP_H_2!H9","v":{"v":0,"d":"0.0000"}},{"$f":"$B9*samband_HP_H_2!I9","v":{"v":0,"d":"0.0000"}},{"$f":"$B9*samband_HP_H_2!F9","v":{"v":0,"d":"0.0000"}},{"$f":"$B9*samband_HP_H_1!N9","v":{"v":0,"d":"0.0000"}}]
["arsenik(V)oxid",{"$f":"Indata!H11","v":{"v":0,"d":"0.0000"}},{"$f":"$B10*samband_HP_H_2!N10","v":{"v":0,"d":"0.0000"}},{"$f":"$B10*samband_HP_H_2!O10","v":{"v":0,"d":"0.0000"}},{"$f":"$B10*samband_HP_H_2!G10","v":{"v":0,"d":"0.0000"}},{"$f":"$B10*samband_HP_H_2!P10","v":{"v":0,"d":"0.0000"}},{"$f":"$B10*samband_HP_H_2!Q10","v":{"v":0,"d":"0.0000"}},{"$f":"$B10*samband_HP_H_2!J10","v":{"v":0,"d":"0.0000"}},{"$f":"$B10*samband_HP_H_2!K10","v":{"v":0,"d":"0.0000"}},{"$f":"$B10*samband_HP_H_2!L10","v":{"v":0,"d":"0.0000"}},{"$f":"$B10*samband_HP_H_2!M10","v":{"v":0,"d":"0.0000"}},{"$f":"$B10*samband_HP_H_2!H10","v":{"v":0,"d":"0.0000"}},{"$f":"$B10*samband_HP_H_2!I10","v":{"v":0,"d":"0.0000"}},{"$f":"$B10*samband_HP_H_2!F10","v":{"v":0,"d":"0.0000"}},{"$f":"$B10*samband_HP_H_1!N10","v":{"v":0,"d":"0.0000"}}]
["barium(II)oxid",{"$f":"Indata!H12","v":{"v":0,"d":"0.0000"}},{"$f":"$B11*samband_HP_H_2!N11","v":{"v":0,"d":"0.0000"}},{"$f":"$B11*samband_HP_H_2!O11","v":{"v":0,"d":"0.0000"}},{"$f":"$B11*samband_HP_H_2!G11","v":{"v":0,"d":"0.0000"}},{"$f":"$B11*samband_HP_H_2!P11","v":{"v":0,"d":"0.0000"}},{"$f":"$B11*samband_HP_H_2!Q11","v":{"v":0,"d":"0.0000"}},{"$f":"$B11*samband_HP_H_2!J11","v":{"v":0,"d":"0.0000"}},{"$f":"$B11*samband_HP_H_2!K11","v":{"v":0,"d":"0.0000"}},{"$f":"$B11*samband_HP_H_2!L11","v":{"v":0,"d":"0.0000"}},{"$f":"$B11*samband_HP_H_2!M11","v":{"v":0,"d":"0.0000"}},{"$f":"$B11*samband_HP_H_2!H11","v":{"v":0,"d":"0.0000"}},{"$f":"$B11*samband_HP_H_2!I11","v":{"v":0,"d":"0.0000"}},{"$f":"$B11*samband_HP_H_2!F11","v":{"v":0,"d":"0.0000"}},{"$f":"$B11*samband_HP_H_1!N11","v":{"v":0,"d":"0.0000"}}]
["bly(II)oxid",{"$f":"Indata!H13","v":{"v":0,"d":"0.0000"}},{"$f":"$B12*samband_HP_H_2!N12","v":{"v":0,"d":"0.0000"}},{"$f":"$B12*samband_HP_H_2!O12","v":{"v":0,"d":"0.0000"}},{"$f":"$B12*samband_HP_H_2!G12","v":{"v":0,"d":"0.0000"}},{"$f":"$B12*samband_HP_H_2!P12","v":{"v":0,"d":"0.0000"}},{"$f":"$B12*samband_HP_H_2!Q12","v":{"v":0,"d":"0.0000"}},{"$f":"$B12*samband_HP_H_2!J12","v":{"v":0,"d":"0.0000"}},{"$f":"$B12*samband_HP_H_2!K12","v":{"v":0,"d":"0.0000"}},{"$f":"$B12*samband_HP_H_2!L12","v":{"v":0,"d":"0.0000"}},{"$f":"$B12*samband_HP_H_2!M12","v":{"v":0,"d":"0.0000"}},{"$f":"$B12*samband_HP_H_2!H12","v":{"v":0,"d":"0.0000"}},{"$f":"$B12*samband_HP_H_2!I12","v":{"v":0,"d":"0.0000"}},{"$f":"$B12*samband_HP_H_2!F12","v":{"v":0,"d":"0.0000"}},{"$f":"$B12*samband_HP_H_1!N12","v":{"v":0,"d":"0.0000"}}]
["kobolt(II)oxid",{"$f":"Indata!H14","v":{"v":0,"d":"0.0000"}},{"$f":"$B13*samband_HP_H_2!N13","v":{"v":0,"d":"0.0000"}},{"$f":"$B13*samband_HP_H_2!O13","v":{"v":0,"d":"0.0000"}},{"$f":"$B13*samband_HP_H_2!G13","v":{"v":0,"d":"0.0000"}},{"$f":"$B13*samband_HP_H_2!P13","v":{"v":0,"d":"0.0000"}},{"$f":"$B13*samband_HP_H_2!Q13","v":{"v":0,"d":"0.0000"}},{"$f":"$B13*samband_HP_H_2!J13","v":{"v":0,"d":"0.0000"}},{"$f":"$B13*samband_HP_H_2!K13","v":{"v":0,"d":"0.0000"}},{"$f":"$B13*samband_HP_H_2!L13","v":{"v":0,"d":"0.0000"}},{"$f":"$B13*samband_HP_H_2!M13","v":{"v":0,"d":"0.0000"}},{"$f":"$B13*samband_HP_H_2!H13","v":{"v":0,"d":"0.0000"}},{"$f":"$B13*samband_HP_H_2!I13","v":{"v":0,"d":"0.0000"}},{"$f":"$B13*samband_HP_H_2!F13","v":{"v":0,"d":"0.0000"}},{"$f":"$B13*samband_HP_H_1!N13","v":{"v":0,"d":"0.0000"}}]
["koppar(II)oxid",{"$f":"Indata!H15","v":{"v":0,"d":"0.0000"}},{"$f":"$B14*samband_HP_H_2!N14","v":{"v":0,"d":"0.0000"}},{"$f":"$B14*samband_HP_H_2!O14","v":{"v":0,"d":"0.0000"}},{"$f":"$B14*samband_HP_H_2!G14","v":{"v":0,"d":"0.0000"}},{"$f":"$B14*samband_HP_H_2!P14","v":{"v":0,"d":"0.0000"}},{"$f":"$B14*samband_HP_H_2!Q14","v":{"v":0,"d":"0.0000"}},{"$f":"$B14*samband_HP_H_2!J14","v":{"v":0,"d":"0.0000"}},{"$f":"$B14*samband_HP_H_2!K14","v":{"v":0,"d":"0.0000"}},{"$f":"$B14*samband_HP_H_2!L14","v":{"v":0,"d":"0.0000"}},{"$f":"$B14*samband_HP_H_2!M14","v":{"v":0,"d":"0.0000"}},{"$f":"$B14*samband_HP_H_2!H14","v":{"v":0,"d":"0.0000"}},{"$f":"$B14*samband_HP_H_2!I14","v":{"v":0,"d":"0.0000"}},{"$f":"$B14*samband_HP_H_2!F14","v":{"v":0,"d":"0.0000"}},{"$f":"$B14*samband_HP_H_1!N14","v":{"v":0,"d":"0.0000"}}]
["CuFe2O4",{"$f":"Indata!H16","v":{"v":0,"d":"0.0000"}},{"$f":"$B15*samband_HP_H_2!N15","v":{"v":0,"d":"0.0000"}},{"$f":"$B15*samband_HP_H_2!O15","v":{"v":0,"d":"0.0000"}},{"$f":"$B15*samband_HP_H_2!G15","v":{"v":0,"d":"0.0000"}},{"$f":"$B15*samband_HP_H_2!P15","v":{"v":0,"d":"0.0000"}},{"$f":"$B15*samband_HP_H_2!Q15","v":{"v":0,"d":"0.0000"}},{"$f":"$B15*samband_HP_H_2!J15","v":{"v":0,"d":"0.0000"}},{"$f":"$B15*samband_HP_H_2!K15","v":{"v":0,"d":"0.0000"}},{"$f":"$B15*samband_HP_H_2!L15","v":{"v":0,"d":"0.0000"}},{"$f":"$B15*samband_HP_H_2!M15","v":{"v":0,"d":"0.0000"}},{"$f":"$B15*samband_HP_H_2!H15","v":{"v":0,"d":"0.0000"}},{"$f":"$B15*samband_HP_H_2!I15","v":{"v":0,"d":"0.0000"}},{"$f":"$B15*samband_HP_H_2!F15","v":{"v":0,"d":"0.0000"}},{"$f":"$B15*samband_HP_H_1!N15","v":{"v":0,"d":"0.0000"}}]
["krom(VI)oxid",{"$f":"Indata!H17","v":{"v":0,"d":"0.0000"}},{"$f":"$B16*samband_HP_H_2!N16","v":{"v":0,"d":"0.0000"}},{"$f":"$B16*samband_HP_H_2!O16","v":{"v":0,"d":"0.0000"}},{"$f":"$B16*samband_HP_H_2!G16","v":{"v":0,"d":"0.0000"}},{"$f":"$B16*samband_HP_H_2!P16","v":{"v":0,"d":"0.0000"}},{"$f":"$B16*samband_HP_H_2!Q16","v":{"v":0,"d":"0.0000"}},{"$f":"$B16*samband_HP_H_2!J16","v":{"v":0,"d":"0.0000"}},{"$f":"$B16*samband_HP_H_2!K16","v":{"v":0,"d":"0.0000"}},{"$f":"$B16*samband_HP_H_2!L16","v":{"v":0,"d":"0.0000"}},{"$f":"$B16*samband_HP_H_2!M16","v":{"v":0,"d":"0.0000"}},{"$f":"$B16*samband_HP_H_2!H16","v":{"v":0,"d":"0.0000"}},{"$f":"$B16*samband_HP_H_2!I16","v":{"v":0,"d":"0.0000"}},{"$f":"$B16*samband_HP_H_2!F16","v":{"v":0,"d":"0.0000"}},{"$f":"$B16*samband_HP_H_1!N16","v":{"v":0,"d":"0.0000"}}]
["krom(III)oxid",{"$f":"Indata!H18","v":{"v":0,"d":"0.0000"}},{"$f":"$B17*samband_HP_H_2!N17","v":{"v":0,"d":"0.0000"}},{"$f":"$B17*samband_HP_H_2!O17","v":{"v":0,"d":"0.0000"}},{"$f":"$B17*samband_HP_H_2!G17","v":{"v":0,"d":"0.0000"}},{"$f":"$B17*samband_HP_H_2!P17","v":{"v":0,"d":"0.0000"}},{"$f":"$B17*samband_HP_H_2!Q17","v":{"v":0,"d":"0.0000"}},{"$f":"$B17*samband_HP_H_2!J17","v":{"v":0,"d":"0.0000"}},{"$f":"$B17*samband_HP_H_2!K17","v":{"v":0,"d":"0.0000"}},{"$f":"$B17*samband_HP_H_2!L17","v":{"v":0,"d":"0.0000"}},{"$f":"$B17*samband_HP_H_2!M17","v":{"v":0,"d":"0.0000"}},{"$f":"$B17*samband_HP_H_2!H17","v":{"v":0,"d":"0.0000"}},{"$f":"$B17*samband_HP_H_2!I17","v":{"v":0,"d":"0.0000"}},{"$f":"$B17*samband_HP_H_2!F17","v":{"v":0,"d":"0.0000"}},{"$f":"$B17*samband_HP_H_1!N17","v":{"v":0,"d":"0.0000"}}]
["molybden(VI)oxid",{"$f":"Indata!H19","v":{"v":0,"d":"0.0000"}},{"$f":"$B18*samband_HP_H_2!N18","v":{"v":0,"d":"0.0000"}},{"$f":"$B18*samband_HP_H_2!O18","v":{"v":0,"d":"0.0000"}},{"$f":"$B18*samband_HP_H_2!G18","v":{"v":0,"d":"0.0000"}},{"$f":"$B18*samband_HP_H_2!P18","v":{"v":0,"d":"0.0000"}},{"$f":"$B18*samband_HP_H_2!Q18","v":{"v":0,"d":"0.0000"}},{"$f":"$B18*samband_HP_H_2!J18","v":{"v":0,"d":"0.0000"}},{"$f":"$B18*samband_HP_H_2!K18","v":{"v":0,"d":"0.0000"}},{"$f":"$B18*samband_HP_H_2!L18","v":{"v":0,"d":"0.0000"}},{"$f":"$B18*samband_HP_H_2!M18","v":{"v":0,"d":"0.0000"}},{"$f":"$B18*samband_HP_H_2!H18","v":{"v":0,"d":"0.0000"}},{"$f":"$B18*samband_HP_H_2!I18","v":{"v":0,"d":"0.0000"}},{"$f":"$B18*samband_HP_H_2!F18","v":{"v":0,"d":"0.0000"}},{"$f":"$B18*samband_HP_H_1!N18","v":{"v":0,"d":"0.0000"}}]
["nickel(II)oxid",{"$f":"Indata!H20","v":{"v":0,"d":"0.0000"}},{"$f":"$B19*samband_HP_H_2!N19","v":{"v":0,"d":"0.0000"}},{"$f":"$B19*samband_HP_H_2!O19","v":{"v":0,"d":"0.0000"}},{"$f":"$B19*samband_HP_H_2!G19","v":{"v":0,"d":"0.0000"}},{"$f":"$B19*samband_HP_H_2!P19","v":{"v":0,"d":"0.0000"}},{"$f":"$B19*samband_HP_H_2!Q19","v":{"v":0,"d":"0.0000"}},{"$f":"$B19*samband_HP_H_2!J19","v":{"v":0,"d":"0.0000"}},{"$f":"$B19*samband_HP_H_2!K19","v":{"v":0,"d":"0.0000"}},{"$f":"$B19*samband_HP_H_2!L19","v":{"v":0,"d":"0.0000"}},{"$f":"$B19*samband_HP_H_2!M19","v":{"v":0,"d":"0.0000"}},{"$f":"$B19*samband_HP_H_2!H19","v":{"v":0,"d":"0.0000"}},{"$f":"$B19*samband_HP_H_2!I19","v":{"v":0,"d":"0.0000"}},{"$f":"$B19*samband_HP_H_2!F19","v":{"v":0,"d":"0.0000"}},{"$f":"$B19*samband_HP_H_1!N19","v":{"v":0,"d":"0.0000"}}]
["NiFe2O4",{"$f":"Indata!H21","v":{"v":0,"d":"0.0000"}},{"$f":"$B20*samband_HP_H_2!N20","v":{"v":0,"d":"0.0000"}},{"$f":"$B20*samband_HP_H_2!O20","v":{"v":0,"d":"0.0000"}},{"$f":"$B20*samband_HP_H_2!G20","v":{"v":0,"d":"0.0000"}},{"$f":"$B20*samband_HP_H_2!P20","v":{"v":0,"d":"0.0000"}},{"$f":"$B20*samband_HP_H_2!Q20","v":{"v":0,"d":"0.0000"}},{"$f":"$B20*samband_HP_H_2!J20","v":{"v":0,"d":"0.0000"}},{"$f":"$B20*samband_HP_H_2!K20","v":{"v":0,"d":"0.0000"}},{"$f":"$B20*samband_HP_H_2!L20","v":{"v":0,"d":"0.0000"}},{"$f":"$B20*samband_HP_H_2!M20","v":{"v":0,"d":"0.0000"}},{"$f":"$B20*samband_HP_H_2!H20","v":{"v":0,"d":"0.0000"}},{"$f":"$B20*samband_HP_H_2!I20","v":{"v":0,"d":"0.0000"}},{"$f":"$B20*samband_HP_H_2!F20","v":{"v":0,"d":"0.0000"}},{"$f":"$B20*samband_HP_H_1!N20","v":{"v":0,"d":"0.0000"}}]
["vanadin(V)oxid",{"$f":"Indata!H22","v":{"v":0,"d":"0.0000"}},{"$f":"$B21*samband_HP_H_2!N21","v":{"v":0,"d":"0.0000"}},{"$f":"$B21*samband_HP_H_2!O21","v":{"v":0,"d":"0.0000"}},{"$f":"$B21*samband_HP_H_2!G21","v":{"v":0,"d":"0.0000"}},{"$f":"$B21*samband_HP_H_2!P21","v":{"v":0,"d":"0.0000"}},{"$f":"$B21*samband_HP_H_2!Q21","v":{"v":0,"d":"0.0000"}},{"$f":"$B21*samband_HP_H_2!J21","v":{"v":0,"d":"0.0000"}},{"$f":"$B21*samband_HP_H_2!K21","v":{"v":0,"d":"0.0000"}},{"$f":"$B21*samband_HP_H_2!L21","v":{"v":0,"d":"0.0000"}},{"$f":"$B21*samband_HP_H_2!M21","v":{"v":0,"d":"0.0000"}},{"$f":"$B21*samband_HP_H_2!H21","v":{"v":0,"d":"0.0000"}},{"$f":"$B21*samband_HP_H_2!I21","v":{"v":0,"d":"0.0000"}},{"$f":"$B21*samband_HP_H_2!F21","v":{"v":0,"d":"0.0000"}},{"$f":"$B21*samband_HP_H_1!N21","v":{"v":0,"d":"0.0000"}}]
["FeV2O4",{"$f":"Indata!H23","v":{"v":0,"d":"0.0000"}},{"$f":"$B22*samband_HP_H_2!N22","v":{"v":0,"d":"0.0000"}},{"$f":"$B22*samband_HP_H_2!O22","v":{"v":0,"d":"0.0000"}},{"$f":"$B22*samband_HP_H_2!G22","v":{"v":0,"d":"0.0000"}},{"$f":"$B22*samband_HP_H_2!P22","v":{"v":0,"d":"0.0000"}},{"$f":"$B22*samband_HP_H_2!Q22","v":{"v":0,"d":"0.0000"}},{"$f":"$B22*samband_HP_H_2!J22","v":{"v":0,"d":"0.0000"}},{"$f":"$B22*samband_HP_H_2!K22","v":{"v":0,"d":"0.0000"}},{"$f":"$B22*samband_HP_H_2!L22","v":{"v":0,"d":"0.0000"}},{"$f":"$B22*samband_HP_H_2!M22","v":{"v":0,"d":"0.0000"}},{"$f":"$B22*samband_HP_H_2!H22","v":{"v":0,"d":"0.0000"}},{"$f":"$B22*samband_HP_H_2!I22","v":{"v":0,"d":"0.0000"}},{"$f":"$B22*samband_HP_H_2!F22","v":{"v":0,"d":"0.0000"}},{"$f":"$B22*samband_HP_H_1!N22","v":{"v":0,"d":"0.0000"}}]
["volfram(VI)oxid",{"$f":"Indata!H24","v":{"v":0,"d":"0.0000"}},{"$f":"$B23*samband_HP_H_2!N23","v":{"v":0,"d":"0.0000"}},{"$f":"$B23*samband_HP_H_2!O23","v":{"v":0,"d":"0.0000"}},{"$f":"$B23*samband_HP_H_2!G23","v":{"v":0,"d":"0.0000"}},{"$f":"$B23*samband_HP_H_2!P23","v":{"v":0,"d":"0.0000"}},{"$f":"$B23*samband_HP_H_2!Q23","v":{"v":0,"d":"0.0000"}},{"$f":"$B23*samband_HP_H_2!J23","v":{"v":0,"d":"0.0000"}},{"$f":"$B23*samband_HP_H_2!K23","v":{"v":0,"d":"0.0000"}},{"$f":"$B23*samband_HP_H_2!L23","v":{"v":0,"d":"0.0000"}},{"$f":"$B23*samband_HP_H_2!M23","v":{"v":0,"d":"0.0000"}},{"$f":"$B23*samband_HP_H_2!H23","v":{"v":0,"d":"0.0000"}},{"$f":"$B23*samband_HP_H_2!I23","v":{"v":0,"d":"0.0000"}},{"$f":"$B23*samband_HP_H_2!F23","v":{"v":0,"d":"0.0000"}},{"$f":"$B23*samband_HP_H_1!N23","v":{"v":0,"d":"0.0000"}}]
["zink(II)oxid",{"$f":"Indata!H25","v":{"v":0,"d":"0.0000"}},{"$f":"$B24*samband_HP_H_2!N24","v":{"v":0,"d":"0.0000"}},{"$f":"$B24*samband_HP_H_2!O24","v":{"v":0,"d":"0.0000"}},{"$f":"$B24*samband_HP_H_2!G24","v":{"v":0,"d":"0.0000"}},{"$f":"$B24*samband_HP_H_2!P24","v":{"v":0,"d":"0.0000"}},{"$f":"$B24*samband_HP_H_2!Q24","v":{"v":0,"d":"0.0000"}},{"$f":"$B24*samband_HP_H_2!J24","v":{"v":0,"d":"0.0000"}},{"$f":"$B24*samband_HP_H_2!K24","v":{"v":0,"d":"0.0000"}},{"$f":"$B24*samband_HP_H_2!L24","v":{"v":0,"d":"0.0000"}},{"$f":"$B24*samband_HP_H_2!M24","v":{"v":0,"d":"0.0000"}},{"$f":"$B24*samband_HP_H_2!H24","v":{"v":0,"d":"0.0000"}},{"$f":"$B24*samband_HP_H_2!I24","v":{"v":0,"d":"0.0000"}},{"$f":"$B24*samband_HP_H_2!F24","v":{"v":0,"d":"0.0000"}},{"$f":"$B24*samband_HP_H_1!N24","v":{"v":0,"d":"0.0000"}}]
["ZnFe2O4",{"$f":"Indata!H26","v":{"v":0,"d":"0.0000"}},{"$f":"$B25*samband_HP_H_2!N25","v":{"v":0,"d":"0.0000"}},{"$f":"$B25*samband_HP_H_2!O25","v":{"v":0,"d":"0.0000"}},{"$f":"$B25*samband_HP_H_2!G25","v":{"v":0,"d":"0.0000"}},{"$f":"$B25*samband_HP_H_2!P25","v":{"v":0,"d":"0.0000"}},{"$f":"$B25*samband_HP_H_2!Q25","v":{"v":0,"d":"0.0000"}},{"$f":"$B25*samband_HP_H_2!J25","v":{"v":0,"d":"0.0000"}},{"$f":"$B25*samband_HP_H_2!K25","v":{"v":0,"d":"0.0000"}},{"$f":"$B25*samband_HP_H_2!L25","v":{"v":0,"d":"0.0000"}},{"$f":"$B25*samband_HP_H_2!M25","v":{"v":0,"d":"0.0000"}},{"$f":"$B25*samband_HP_H_2!H25","v":{"v":0,"d":"0.0000"}},{"$f":"$B25*samband_HP_H_2!I25","v":{"v":0,"d":"0.0000"}},{"$f":"$B25*samband_HP_H_2!F25","v":{"v":0,"d":"0.0000"}},{"$f":"$B25*samband_HP_H_1!N25","v":{"v":0,"d":"0.0000"}}]
["kadmium(II)klorid",{"$f":"Indata!H27","v":{"v":0,"d":"0.0000"}},{"$f":"$B26*samband_HP_H_2!N26","v":{"v":0,"d":"0.0000"}},{"$f":"$B26*samband_HP_H_2!O26","v":{"v":0,"d":"0.0000"}},{"$f":"$B26*samband_HP_H_2!G26","v":{"v":0,"d":"0.0000"}},{"$f":"$B26*samband_HP_H_2!P26","v":{"v":0,"d":"0.0000"}},{"$f":"$B26*samband_HP_H_2!Q26","v":{"v":0,"d":"0.0000"}},{"$f":"$B26*samband_HP_H_2!J26","v":{"v":0,"d":"0.0000"}},{"$f":"$B26*samband_HP_H_2!K26","v":{"v":0,"d":"0.0000"}},{"$f":"$B26*samband_HP_H_2!L26","v":{"v":0,"d":"0.0000"}},{"$f":"$B26*samband_HP_H_2!M26","v":{"v":0,"d":"0.0000"}},{"$f":"$B26*samband_HP_H_2!H26","v":{"v":0,"d":"0.0000"}},{"$f":"$B26*samband_HP_H_2!I26","v":{"v":0,"d":"0.0000"}},{"$f":"$B26*samband_HP_H_2!F26","v":{"v":0,"d":"0.0000"}},{"$f":"$B26*samband_HP_H_1!N26","v":{"v":0,"d":"0.0000"}}]
["kvicksilver(II)klorid",{"$f":"Indata!H28","v":{"v":0,"d":"0.0000"}},{"$f":"$B27*samband_HP_H_2!N27","v":{"v":0,"d":"0.0000"}},{"$f":"$B27*samband_HP_H_2!O27","v":{"v":0,"d":"0.0000"}},{"$f":"$B27*samband_HP_H_2!G27","v":{"v":0,"d":"0.0000"}},{"$f":"$B27*samband_HP_H_2!P27","v":{"v":0,"d":"0.0000"}},{"$f":"$B27*samband_HP_H_2!Q27","v":{"v":0,"d":"0.0000"}},{"$f":"$B27*samband_HP_H_2!J27","v":{"v":0,"d":"0.0000"}},{"$f":"$B27*samband_HP_H_2!K27","v":{"v":0,"d":"0.0000"}},{"$f":"$B27*samband_HP_H_2!L27","v":{"v":0,"d":"0.0000"}},{"$f":"$B27*samband_HP_H_2!M27","v":{"v":0,"d":"0.0000"}},{"$f":"$B27*samband_HP_H_2!H27","v":{"v":0,"d":"0.0000"}},{"$f":"$B27*samband_HP_H_2!I27","v":{"v":0,"d":"0.0000"}},{"$f":"$B27*samband_HP_H_2!F27","v":{"v":0,"d":"0.0000"}},{"$f":"$B27*samband_HP_H_1!N27","v":{"v":0,"d":"0.0000"}}]
["ammoniak",{"$f":"Indata!H29","v":{"v":0,"d":"0.0000"}},{"$f":"$B28*samband_HP_H_2!N28","v":{"v":0,"d":"0.0000"}},{"$f":"$B28*samband_HP_H_2!O28","v":{"v":0,"d":"0.0000"}},{"$f":"$B28*samband_HP_H_2!G28","v":{"v":0,"d":"0.0000"}},{"$f":"$B28*samband_HP_H_2!P28","v":{"v":0,"d":"0.0000"}},{"$f":"$B28*samband_HP_H_2!Q28","v":{"v":0,"d":"0.0000"}},{"$f":"$B28*samband_HP_H_2!J28","v":{"v":0,"d":"0.0000"}},{"$f":"$B28*samband_HP_H_2!K28","v":{"v":0,"d":"0.0000"}},{"$f":"$B28*samband_HP_H_2!L28","v":{"v":0,"d":"0.0000"}},{"$f":"$B28*samband_HP_H_2!M28","v":{"v":0,"d":"0.0000"}},{"$f":"$B28*samband_HP_H_2!H28","v":{"v":0,"d":"0.0000"}},{"$f":"$B28*samband_HP_H_2!I28","v":{"v":0,"d":"0.0000"}},{"$f":"$B28*samband_HP_H_2!F28","v":{"v":0,"d":"0.0000"}},{"$f":"$B28*samband_HP_H_1!N28","v":{"v":0,"d":"0.0000"}}]
["Största värde",null,{"$f":"LARGE(C8:C28,1)","v":{"v":0,"d":"0.0000"}},{"$f":"LARGE(D8:D28,1)","v":{"v":0,"d":"0.0000"}},{"v":0,"d":"0.0000"},{"v":0,"d":"0.0000"},{"v":0,"d":"0.0000"},{"v":0,"d":"0.0000"},{"v":0,"d":"0.0000"},{"v":0,"d":"0.0000"},{"v":0,"d":"0.0000"},{"$f":"LARGE(L8:L28,1)","v":{"v":0,"d":"0.0000"}},{"$f":"LARGE(M8:M28,1)","v":{"v":0,"d":"0.0000"}},{"$f":"LARGE(N8:N28,1)","v":{"v":0,"d":"0.0000"}},{"$f":"LARGE(O8:O28,1)","v":{"v":0,"d":"0.0000"}}]
["Gräns %",null,1,10,20,1,10,0.1,1,0.3,3,0.1,1,10,10]
["Farligt avfall?",null,{"$f":"IF(C29<C30,0,1)","v":0},{"$f":"IF(D29<D30,0,1)","v":0},0,0,0,0,0,0,0,{"$f":"IF(L29<L30,0,1)","v":0},{"$f":"IF(M29<M30,0,1)","v":0},{"$f":"IF(N29<N30,0,1)","v":0},{"$f":"IF(O29<O30,0,1)","v":0}]

{"sheet":"Ekotox","index":8,"n_rows":31,"n_cols":11,"rows_kept":31}
[]
[]
["Klassning av ekotox enligt gamla märkningsregler som bygger på KIFS 2005:7  "]
[]
[null,"För","Risk-","Vikt-","Enligt","Enligt"]
["HP 14","kalkyl","fraser /","nings-","domar","dom"]
[null,"%","R-värden","faktorer","[1-3]","[4]"]
["antimon(III)oxid",{"$f":"Indata!H9","v":{"v":0,"d":"0.0000"}},null,{"v":0,"d":"0.00"},{"$f":"$B8*$D8","v":{"v":0,"d":"0.0000"}},{"$f":"$B8*$D8","v":{"v":0,"d":"0.0000"}},null,"[1] ","M 4182-00","2003-12-18","Miljööverdomstolen"]
["arsenik(III)oxid",{"$f":"Indata!H10","v":{"v":0,"d":"0.0000"}},"50-53",{"v":1,"d":"1.00"},{"$f":"$B9*$D9","v":{"v":0,"d":"0.0000"}},{"v":0,"d":"0.0000"},null,"[2]","M 1715-07","2009-01-30","Miljödomstolen, Nacka "]
["arsenik(V)oxid",{"$f":"Indata!H11","v":{"v":0,"d":"0.0000"}},"50-53",{"v":1,"d":"1.00"},{"v":0,"d":"0.0000"},{"v":0,"d":"0.0000"},null,"[3]","M 1592-09","2010-01-27","Miljööverdomstolen"]
["barium(II)oxid",{"$f":"Indata!H12","v":{"v":0,"d":"0.0000"}},null,{"v":0,"d":"0.00"},{"v":0,"d":"0.0000"},{"v":0,"d":"0.0000"},null,"[4]","M 654-11","2015-01-07","Mark- och Miljödomstolen,"]
["bly(II)oxid",{"$f":"Indata!H13","v":{"v":0,"d":"0.0000"}},"50-53",{"v":1,"d":"1.00"},{"v":0,"d":"0.0000"},{"v":0,"d":"0.0000"},{"$nulls":4},"Vänersborg"]
["kobolt(II)oxid",{"$f":"Indata!H14","v":{"v":0,"d":"0.0000"}},"50-53",{"v":1,"d":"1.00"},{"v":0,"d":"0.0000"},{"v":0,"d":"0.0000"}]
["koppar(II)oxid",{"$f":"Indata!H15","v":{"v":0,"d":"0.0000"}},"50-53*",{"v":1,"d":"1.00"},{"v":0,"d":"0.0000"},{"v":0,"d":"0.0000"},null,"*","Koppar har under år 2016 fått en harmoniserad klassning"]
["CuFe2O4",{"$f":"Indata!H16","v":{"v":0,"d":"0.0000"}},null,{"v":0,"d":"0.00"},{"v":0,"d":"0.0000"},{"v":0,"d":"0.0000"},null,null,"enligt CLP med H400 och H410, men inte någon riskfras."]
["krom(VI)oxid",{"$f":"Indata!H17","v":{"v":0,"d":"0.0000"}},"50-53",{"v":1,"d":"1.00"},{"v":0,"d":"0.0000"},{"v":0,"d":"0.0000"},null,null,"Detta tolkas dock försiktigtvis som R 50-53"]
["krom(III)oxid",{"$f":"Indata!H18","v":{"v":0,"d":"0.0000"}},null,{"v":0,"d":"0.00"},{"v":0,"d":"0.0000"},{"v":0,"d":"0.0000"}]
["molybden(VI)oxid",{"$f":"Indata!H19","v":{"v":0,"d":"0.0000"}},null,{"v":0,"d":"0.00"},{"v":0,"d":"0.0000"},{"v":0,"d":"0.0000"}]
["nickel(II)oxid",{"$f":"Indata!H20","v":{"v":0,"d":"0.0000"}},53,0.01,{"v":0,"d":"0.0000"},{"v":0,"d":"0.0000"}]
["NiFe2O4",{"$f":"Indata!H21","v":{"v":0,"d":"0.0000"}},null,{"v":0,"d":"0.00"},{"v":0,"d":"0.0000"},{"v":0,"d":"0.0000"}]
["vanadin(V)oxid",{"$f":"Indata!H22","v":{"v":0,"d":"0.0000"}},"51-53",{"v":0.1,"d":"0.10"},{"v":0,"d":"0.0000"},{"v":0,"d":"0.0000"}]
["FeV2O4",{"$f":"Indata!H23","v":{"v":0,"d":"0.0000"}},null,{"v":0,"d":"0.00"},{"v":0,"d":"0.0000"},{"v":0,"d":"0.0000"}]
["volfram(VI)oxid",{"$f":"Indata!H24","v":{"v":0,"d":"0.0000"}},null,{"v":0,"d":"0.00"},{"v":0,"d":"0.0000"},{"v":0,"d":"0.0000"}]
["zink(II)oxid",{"$f":"Indata!H25","v":{"v":0,"d":"0.0000"}},"50-53",{"v":1,"d":"1.00"},{"v":0,"d":"0.0000"},{"v":0,"d":"0.0000"}]
["ZnFe2O4",{"$f":"Indata!H26","v":{"v":0,"d":"0.0000"}},null,{"v":0,"d":"0.00"},{"v":0,"d":"0.0000"},{"v":0,"d":"0.0000"}]
["kadmium(II)klorid",{"$f":"Indata!H27","v":{"v":0,"d":"0.0000"}},"50-53",{"v":1,"d":"1.00"},{"v":0,"d":"0.0000"},{"v":0,"d":"0.0000"}]
["kvicksilver(II)klorid",{"$f":"Indata!H28","v":{"v":0,"d":"0.0000"}},"50-53",{"v":1,"d":"1.00"},{"v":0,"d":"0.0000"},{"v":0,"d":"0.0000"}]
["ammoniak",{"$f":"Indata!H29","v":{"v":0,"d":"0.0000"}},50,{"v":1,"d":"1.00"},{"v":0,"d":"0.0000"},{"v":0,"d":"0.0000"}]
["Summa",{"$nulls":3},{"$f":"SUM(E8:E28)","v":{"v":0,"d":"0.0000"}},{"$f":"SUM(F8:F28)","v":{"v":0,"d":"0.0000"}}]
["Gräns %",{"$nulls":3},2.5,0.25]
["Farligt avfall?",{"$nulls":3},{"$f":"IF(E29<E30,0,1)","v":0},{"$f":"IF(F29<F30,0,1)","v":0}]

{"sheet":"Sammanfattning","index":9,"n_rows":17,"n_cols":5,"rows_kept":17}
[]
[]
["Sammanfattning av resultaten av kalkylerna"]
[]
[null,{"$f":"IF(Indata!A2=0,\"\",Indata!A2)","v":""},"Antal"]
[null,{"$f":"IF(Indata!A3=0,\"\",Indata!A3)","v":""},"över-","Farligt?","Farligt?"]
[null,{"$f":"IF(Indata!A4=0,\"\",Indata!A4)","v":""},"skridanden"]
["HP 4","Irriterande – hudirritation och ögonskador",{"$f":"SUM(HP_4_8_6A!D32:F32)","v":0},{"$f":"IF(C8>0,\"ja\",\" \")","v":" "},{"$f":"IF(C8>0,\" \",\"nej\")","v":"nej"}]
["HP 5","Specifik toxicitet för målorgan (STOT)",{"$f":"SUM(HP_5_7_10_11_13!C31:G31)","v":0},{"$f":"IF(C9>0,\"ja\",\" \")","v":" "},{"$f":"IF(C9>0,\" \",\"nej\")","v":"nej"}]
["HP 6","Akut toxicitet",{"$f":"SUM(HP_4_8_6A!H32:J32,HP_6B!D32:L32)","v":0}," ","nej"]
["HP 7","Cancerframkallande",{"$f":"SUM(HP_5_7_10_11_13!H31:I31)","v":0}," ","nej"]
["HP 8","Frätande",{"$f":"SUM(HP_4_8_6A!G32)","v":0}," ","nej"]
["HP 10","Reproduktionstoxiskt",{"$f":"SUM(HP_5_7_10_11_13!J31:K31)","v":0}," ","nej"]
["HP 11","Mutagent",{"$f":"SUM(HP_5_7_10_11_13!L31:M31)","v":0}," ","nej"]
["HP 13","Allergiframkallande",{"$f":"SUM(HP_5_7_10_11_13!N31:O31)","v":0}," ","nej"]
["HP 14","Ekotoxiskt (högre rätt)",{"$f":"Ekotox!E31","v":0}," ","nej"]
["HP 14","Ekotoxiskt (lägre rätt)",{"$f":"Ekotox!F31","v":0}," ","nej"]